< Previous by Date Date Index Next by Date >
  Thread Index Next in Thread >

[repro-users] compile problem.


Hello Everyone,
I  tried compile version 1.12 beta 6 and it failing .  Any help thank you.


libtool: link: ( cd ".libs" && rm -f "librepro.la" && ln -s "../librepro.la" "librepro.la" )
/bin/sh ../libtool  --tag=CXX   --mode=link g++ -I .. -O2 -g -pipe -Wall -Werror=format-security -Wp,-D_FORTIFY_SOURCE=2 -Wp,-D_GLIBCXX_ASSERTIONS -fexceptions -fstack-protector-strong -grecord-gcc-switches -specs=/usr/lib/rpm/redhat/redhat-hardened-cc1 -specs=/usr/lib/rpm/redhat/redhat-annobin-cc1 -m64 -mtune=generic -fasynchronous-unwind-tables -fstack-clash-protection -fcf-protection -I/usr/include/libdb4 -D__STDC_LIMIT_MACROS -D__STDC_CONSTANT_MACROS -D__STDC_FORMAT_MACROS -Wall -Wno-deprecated  -L/usr/lib64/mysql -L/usr/lib64/libdb4 -o repro repro.o librepro.la ../resip/dum/libdum.la ../resip/stack/libresip.la ../rutil/librutil.la -lradcli -lssl -lcrypto -lpthread  -ldl -lcares 
libtool: link: g++ -I .. -O2 -g -pipe -Wall -Werror=format-security -Wp,-D_FORTIFY_SOURCE=2 -Wp,-D_GLIBCXX_ASSERTIONS -fexceptions -fstack-protector-strong -grecord-gcc-switches -specs=/usr/lib/rpm/redhat/redhat-hardened-cc1 -specs=/usr/lib/rpm/redhat/redhat-annobin-cc1 -m64 -mtune=generic -fasynchronous-unwind-tables -fstack-clash-protection -fcf-protection -I/usr/include/libdb4 -D__STDC_LIMIT_MACROS -D__STDC_CONSTANT_MACROS -D__STDC_FORMAT_MACROS -Wall -Wno-deprecated -o .libs/repro repro.o  -L/usr/lib64/mysql -L/usr/lib64/libdb4 ./.libs/librepro.so -ldb_cxx /home/volga629/rpmbuild/BUILD/resiprocate-1.12.0/resip/dum/.libs/libdum.so -lmysqlclient -lpq ../resip/dum/.libs/libdum.so /home/volga629/rpmbuild/BUILD/resiprocate-1.12.0/resip/stack/.libs/libresip.so ../resip/stack/.libs/libresip.so /home/volga629/rpmbuild/BUILD/resiprocate-1.12.0/rutil/.libs/librutil.so ../rutil/.libs/librutil.so -lradcli -lssl -lcrypto -lpthread -ldl -lcares
/home/volga629/rpmbuild/BUILD/resiprocate-1.12.0/resip/stack/.libs/libresip.so: undefined reference to `resip::MonthHash::in_word_set(char const*, unsigned long)'
/home/volga629/rpmbuild/BUILD/resiprocate-1.12.0/resip/stack/.libs/libresip.so: undefined reference to `resip::MethodHash::in_word_set(char const*, unsigned long)'
/home/volga629/rpmbuild/BUILD/resiprocate-1.12.0/resip/stack/.libs/libresip.so: undefined reference to `resip::DayOfWeekHash::in_word_set(char const*, unsigned long)'
/home/volga629/rpmbuild/BUILD/resiprocate-1.12.0/resip/stack/.libs/libresip.so: undefined reference to `resip::ParameterHash::in_word_set(char const*, unsigned long)'
/home/volga629/rpmbuild/BUILD/resiprocate-1.12.0/resip/stack/.libs/libresip.so: undefined reference to `resip::HeaderHash::in_word_set(char const*, unsigned long)'
collect2: error: ld returned 1 exit status
make[3]: *** [Makefile:864: repro] Error 1
make[3]: Leaving directory '/home/volga629/rpmbuild/BUILD/resiprocate-1.12.0/repro'
make[2]: *** [Makefile:1568: all-recursive] Error 1
make[2]: Leaving directory '/home/volga629/rpmbuild/BUILD/resiprocate-1.12.0/repro'
make[1]: *** [Makefile:449: all-recursive] Error 1
make[1]: Leaving directory '/home/volga629/rpmbuild/BUILD/resiprocate-1.12.0'
make: *** [Makefile:379: all] Error 2
error: Bad exit status from /var/tmp/rpm-tmp.yDd2PY (%build)


RPM build errors:
    Bad exit status from /var/tmp/rpm-tmp.yDd2PY (%build)

volga629